Ar..NO anion

Gas phase thermochemistry data

Data compiled by: John E. Bartmess

Quantity Value Units Method Reference Comment
Δfgas81.9 ± 1.6kJ/molTherBowen and Eaton, 1988

Reaction thermochemistry data

Data compiled by: John E. Bartmess

Individual Reactions

ArNO- + 2Argon = Ar2NO-

By formula: ArNO- + 2Ar = Ar2NO-

Quantity Value Units Method Reference Comment
Δr6.28kJ/molN/AHendricks, de Clercq, et al., 2002gas phase

Gas phase ion energetics data

Data compiled by: John E. Bartmess

Electron affinity of neutral species

EAneutral (eV) Method Reference Comment
0.0840 ± 0.0030LPESHendricks, de Clercq, et al., 2002
0.095 ± 0.011LPESBowen and Eaton, 1988

Ion clustering data

Data compiled by: John E. Bartmess

Clustering reactions

ArNO- + 2Argon = Ar2NO-

By formula: ArNO- + 2Ar = Ar2NO-

Quantity Value Units Method Reference Comment
Δr6.28kJ/molN/AHendricks, de Clercq, et al., 2002gas phase

References

Bowen and Eaton, 1988
Bowen, K.H.; Eaton, J.G., Photodetachment Spectroscopy of Negative Cluster Ions, in The Structure of Small Molecules and Ions, Ed. R. Naaman, Z. Vager, Plenum NY, 1988, 1988, p.147-169. [all data]

Hendricks, de Clercq, et al., 2002
Hendricks, J.H.; de Clercq, H.L.; Freidhoff, C.B.; Arnold, S.T.; Eaton, J.G.; Fancher, C.; Lyapustina, S.A.; S., Anion solvation at the microscopic level: Photoelectron spectroscopy of the solvated anion clusters, NO-(Y)(n), where Y=Ar, Kr, Xe, N2O, H2S, NH3, H2O, and C2H4(OH)(2), J. Chem. Phys., 2002, 116, 18, 7926-7938, https://doi.org/10.1063/1.1457444 . [all data]