RbSO4 anion

Gas phase thermochemistry data

Data compiled by: John E. Bartmess

Quantity Value Units Method Reference Comment
Δfgas-976. ± 12.kJ/molTDEqRudnyi, Vovk, et al., 1989ΔHf(A-) at 0 K; value altered from reference due to conversion from electron convention to ion convention

References

Rudnyi, Vovk, et al., 1989
Rudnyi, E.B.; Vovk, O.M.; Kaibicheva, E.A.; Sidorov, L.N., Formation Enthalpies of Oxygen Containing Anions of Group VI Elements in the Gas Phase and the Electron Affinities of CrO3, MoO3, and WO3, J. Chem. Thermodyn., 1989, 21, 3, 247, https://doi.org/10.1016/0021-9614(89)90014-1 . [all data]