Benzene, pentafluoronitro- anion

Gas phase thermochemistry data

Data compiled by: John E. Bartmess

Quantity Value Units Method Reference Comment
Δfgas-227.8 ± 2.7kcal/molR-EADillow and Kebarle, 1989ΔGea(423 K) = -35.0±1.0 kcal/mol , assumed entropy = 3.5 eu

References

Dillow and Kebarle, 1989
Dillow, G.W.; Kebarle, P., Substituent Effects on the Electron Affinities of Perfluorobenzenes C6F5X, J. Am. Chem. Soc., 1989, 111, 15, 5592, https://doi.org/10.1021/ja00197a014 . [all data]