CH2=CHCH2CH2 anion
- Formula: C4H7-
- Molecular weight: 55.0989

Gas phase ion energetics data

Data compiled by: John E. Bartmess
Protonation reactions
Quantity | Value | Units | Method | Reference | Comment |
---|---|---|---|---|---|
ΔrH° | 412.0 ± 2.0 | kcal/mol | Bran | DePuy, Gronert, et al., 1989 | gas phase |
ΔrH° | 413.2 ± 4.8 | kcal/mol | Bran | Peerboom, Rademaker, et al., 1992 | gas phase |
Quantity | Value | Units | Method | Reference | Comment |
ΔrG° | 404.0 ± 2.1 | kcal/mol | H-TS | DePuy, Gronert, et al., 1989 | gas phase |
ΔrG° | 405.2 ± 4.9 | kcal/mol | H-TS | Peerboom, Rademaker, et al., 1992 | gas phase |

Reaction thermochemistry data

Data compiled by: John E. Bartmess

Individual Reactions

C4H7- + Hydrogen cation = 1-Butene

By formula: C4H7- + H+ = C4H8

Quantity Value Units Method Reference Comment
Δr1724. ± 8.4kJ/molBranDePuy, Gronert, et al., 1989gas phase
Δr1729. ± 20.kJ/molBranPeerboom, Rademaker, et al., 1992gas phase
Quantity Value Units Method Reference Comment
Δr1690. ± 8.8kJ/molH-TSDePuy, Gronert, et al., 1989gas phase
Δr1695. ± 21.kJ/molH-TSPeerboom, Rademaker, et al., 1992gas phase

References

DePuy, Gronert, et al., 1989
DePuy, C.H.; Gronert, S.; Barlow, S.E.; Bierbaum, V.M.; Damrauer, R.,
The Gas Phase Acidities of the Alkanes,
J. Am. Chem. Soc., 1989, 111, 6, 1968, https://doi.org/10.1021/ja00188a003
. [all data]
Peerboom, Rademaker, et al., 1992
Peerboom, R.A.L.; Rademaker, G.J.; Dekoning, L.J.; Nibbering, N.M.M.,
Stabilization of Cycloalkyl Carbanions in the Gas Phase,
Rapid Commun. Mass Spectrom., 1992, 6, 6, 394, https://doi.org/10.1002/rcm.1290060608
. [all data]