1-Me-cyclopropanide anion

Gas phase ion energetics data

Data compiled by: John E. Bartmess

Protonation reactions

C4H7- + Hydrogen cation = Methylcyclopropane

By formula: C4H7- + H+ = C4H8

Quantity Value Units Method Reference Comment
Δr1712. ± 8.4kJ/molBranDePuy, Gronert, et al., 1989gas phase
Δr1728. ± 15.kJ/molCIDTGraul and Squires, 1990gas phase
Quantity Value Units Method Reference Comment
Δr1680. ± 8.8kJ/molH-TSDePuy, Gronert, et al., 1989gas phase

Reaction thermochemistry data

Data compiled by: John E. Bartmess

Individual Reactions

C4H7- + Hydrogen cation = Methylcyclopropane

By formula: C4H7- + H+ = C4H8

Quantity Value Units Method Reference Comment
Δr1712. ± 8.4kJ/molBranDePuy, Gronert, et al., 1989gas phase
Δr1728. ± 15.kJ/molCIDTGraul and Squires, 1990gas phase
Quantity Value Units Method Reference Comment
Δr1680. ± 8.8kJ/molH-TSDePuy, Gronert, et al., 1989gas phase

References

DePuy, Gronert, et al., 1989
DePuy, C.H.; Gronert, S.; Barlow, S.E.; Bierbaum, V.M.; Damrauer, R., The Gas Phase Acidities of the Alkanes, J. Am. Chem. Soc., 1989, 111, 6, 1968, https://doi.org/10.1021/ja00188a003 . [all data]

Graul and Squires, 1990
Graul, S.T.; Squires, R.R., Gas-Phase Acidities Derived from Threshold Energies for Activated Reactions, J. Am. Chem. Soc., 1990, 112, 7, 2517, https://doi.org/10.1021/ja00163a007 . [all data]