cPrCH2 anion

Reaction thermochemistry data

Data compiled by: John E. Bartmess

Individual Reactions

C4H7- + Hydrogen cation = Methylcyclopropane

By formula: C4H7- + H+ = C4H8

Quantity Value Units Method Reference Comment
Δr410.5 ± 2.0kcal/molBranDePuy, Gronert, et al., 1989gas phase
Quantity Value Units Method Reference Comment
Δr402.1 ± 2.1kcal/molH-TSDePuy, Gronert, et al., 1989gas phase

Gas phase ion energetics data

Data compiled by: John E. Bartmess

Electron affinity of neutral species

EAneutral (eV) Method Reference Comment
0.16 ± 0.12D-EADePuy, Gronert, et al., 1989

Protonation reactions

C4H7- + Hydrogen cation = Methylcyclopropane

By formula: C4H7- + H+ = C4H8

Quantity Value Units Method Reference Comment
Δr410.5 ± 2.0kcal/molBranDePuy, Gronert, et al., 1989gas phase
Quantity Value Units Method Reference Comment
Δr402.1 ± 2.1kcal/molH-TSDePuy, Gronert, et al., 1989gas phase

References

DePuy, Gronert, et al., 1989
DePuy, C.H.; Gronert, S.; Barlow, S.E.; Bierbaum, V.M.; Damrauer, R., The Gas Phase Acidities of the Alkanes, J. Am. Chem. Soc., 1989, 111, 6, 1968, https://doi.org/10.1021/ja00188a003 . [all data]