Et(Me)CH anion

Reaction thermochemistry data

Data compiled by: John E. Bartmess

Individual Reactions

C4H9- + Hydrogen cation = Butane

By formula: C4H9- + H+ = C4H10

Quantity Value Units Method Reference Comment
Δr1739. ± 8.4kJ/molBranDePuy, Gronert, et al., 1989gas phase; The HOF(Et(Me)N.) in Seetula, Russell, et al., 1990 gives BDE(N-H) = 99 kcal/mol, ca. 5 kcal/mol too strong
Δr1745. ± 20.kJ/molBranPeerboom, Rademaker, et al., 1992gas phase
Quantity Value Units Method Reference Comment
Δr1703. ± 8.8kJ/molH-TSDePuy, Gronert, et al., 1989gas phase; The HOF(Et(Me)N.) in Seetula, Russell, et al., 1990 gives BDE(N-H) = 99 kcal/mol, ca. 5 kcal/mol too strong
Δr1709. ± 21.kJ/molH-TSPeerboom, Rademaker, et al., 1992gas phase

Gas phase ion energetics data

Data compiled by: John E. Bartmess

Protonation reactions

C4H9- + Hydrogen cation = Butane

By formula: C4H9- + H+ = C4H10

Quantity Value Units Method Reference Comment
Δr1739. ± 8.4kJ/molBranDePuy, Gronert, et al., 1989gas phase; The HOF(Et(Me)N.) in Seetula, Russell, et al., 1990 gives BDE(N-H) = 99 kcal/mol, ca. 5 kcal/mol too strong
Δr1745. ± 20.kJ/molBranPeerboom, Rademaker, et al., 1992gas phase
Quantity Value Units Method Reference Comment
Δr1703. ± 8.8kJ/molH-TSDePuy, Gronert, et al., 1989gas phase; The HOF(Et(Me)N.) in Seetula, Russell, et al., 1990 gives BDE(N-H) = 99 kcal/mol, ca. 5 kcal/mol too strong
Δr1709. ± 21.kJ/molH-TSPeerboom, Rademaker, et al., 1992gas phase

References

DePuy, Gronert, et al., 1989
DePuy, C.H.; Gronert, S.; Barlow, S.E.; Bierbaum, V.M.; Damrauer, R., The Gas Phase Acidities of the Alkanes, J. Am. Chem. Soc., 1989, 111, 6, 1968, https://doi.org/10.1021/ja00188a003 . [all data]

Seetula, Russell, et al., 1990
Seetula, J.A.; Russell, J.J.; Gutman, D., Kinetics and Thermochemistry of the Reactions of Alkyl Radicals with HI: A Reconciliation of the Alkyl Radical Heats of Formation, J. Am. Chem. Soc., 1990, 112, 4, 1347, https://doi.org/10.1021/ja00160a009 . [all data]

Peerboom, Rademaker, et al., 1992
Peerboom, R.A.L.; Rademaker, G.J.; Dekoning, L.J.; Nibbering, N.M.M., Stabilization of Cycloalkyl Carbanions in the Gas Phase, Rapid Commun. Mass Spectrom., 1992, 6, 6, 394, https://doi.org/10.1002/rcm.1290060608 . [all data]