cyclopentanide anion

Reaction thermochemistry data

Data compiled by: John E. Bartmess

Individual Reactions

C5H9- + Hydrogen cation = Cyclopentane

By formula: C5H9- + H+ = C5H10

Quantity Value Units Method Reference Comment
Δr1741. ± 8.4kJ/molBranDePuy, Gronert, et al., 1989gas phase
Δr1750. ± 8.4kJ/molBranPeerboom, Rademaker, et al., 1992gas phase
Quantity Value Units Method Reference Comment
Δr1705. ± 8.8kJ/molH-TSDePuy, Gronert, et al., 1989gas phase
Δr1714. ± 8.8kJ/molH-TSPeerboom, Rademaker, et al., 1992gas phase

Gas phase ion energetics data

Data compiled by: John E. Bartmess

Protonation reactions

C5H9- + Hydrogen cation = Cyclopentane

By formula: C5H9- + H+ = C5H10

Quantity Value Units Method Reference Comment
Δr1741. ± 8.4kJ/molBranDePuy, Gronert, et al., 1989gas phase
Δr1750. ± 8.4kJ/molBranPeerboom, Rademaker, et al., 1992gas phase
Quantity Value Units Method Reference Comment
Δr1705. ± 8.8kJ/molH-TSDePuy, Gronert, et al., 1989gas phase
Δr1714. ± 8.8kJ/molH-TSPeerboom, Rademaker, et al., 1992gas phase

References

DePuy, Gronert, et al., 1989
DePuy, C.H.; Gronert, S.; Barlow, S.E.; Bierbaum, V.M.; Damrauer, R., The Gas Phase Acidities of the Alkanes, J. Am. Chem. Soc., 1989, 111, 6, 1968, https://doi.org/10.1021/ja00188a003 . [all data]

Peerboom, Rademaker, et al., 1992
Peerboom, R.A.L.; Rademaker, G.J.; Dekoning, L.J.; Nibbering, N.M.M., Stabilization of Cycloalkyl Carbanions in the Gas Phase, Rapid Commun. Mass Spectrom., 1992, 6, 6, 394, https://doi.org/10.1002/rcm.1290060608 . [all data]