MeSO2CHCN anion

Gas phase ion energetics data

Data compiled by: John E. Bartmess

Protonation reactions

C3H4NO2S- + Hydrogen cation = Methanesulfonylacetonitrile

By formula: C3H4NO2S- + H+ = C3H5NO2S

Quantity Value Units Method Reference Comment
Δr1407. ± 9.6kJ/molG+TSTaft, Abboud, et al., 1988gas phase; Revised: this is 0.9 smaller than reported (91TAF)
Quantity Value Units Method Reference Comment
Δr1375. ± 8.4kJ/molIMRETaft, Abboud, et al., 1988gas phase; Revised: this is 0.9 smaller than reported (91TAF)

References

Taft, Abboud, et al., 1988
Taft, R.W.; Abboud, J.L.M.; Anvia, F.; Berthelot, M.; Fujio, M.; Gal, J.-F.; Headley, A.D.; Henderson, W.G., Regarding the Inherent Dependence of Resonance Effects of Strongly Conjugated Substituents on Electron Demand, J. Am. Chem. Soc., 1988, 110, 6, 1797, https://doi.org/10.1021/ja00214a023 . [all data]