PhCOCHCN anion

Gas phase ion energetics data

Data compiled by: John E. Bartmess

Protonation reactions

C9H6NO- + Hydrogen cation = Benzenepropanenitrile, β-oxo-

By formula: C9H6NO- + H+ = C9H7NO

Quantity Value Units Method Reference Comment
Δr326.3 ± 2.0kcal/molIMRETaft, Abboud, et al., 1988gas phase; Revised 0.9 smaller: 91TAF

Reaction thermochemistry data

Data compiled by: John E. Bartmess

Individual Reactions

C9H6NO- + Hydrogen cation = Benzenepropanenitrile, β-oxo-

By formula: C9H6NO- + H+ = C9H7NO

Quantity Value Units Method Reference Comment
Δr326.3 ± 2.0kcal/molIMRETaft, Abboud, et al., 1988gas phase; Revised 0.9 smaller: 91TAF

References

Taft, Abboud, et al., 1988
Taft, R.W.; Abboud, J.L.M.; Anvia, F.; Berthelot, M.; Fujio, M.; Gal, J.-F.; Headley, A.D.; Henderson, W.G., Regarding the Inherent Dependence of Resonance Effects of Strongly Conjugated Substituents on Electron Demand, J. Am. Chem. Soc., 1988, 110, 6, 1797, https://doi.org/10.1021/ja00214a023 . [all data]