CH2=CHCH(nPr)O anion

Reaction thermochemistry data

Data compiled by: John E. Bartmess

Individual Reactions

C6H11O- + Hydrogen cation = 1-Hexen-3-ol

By formula: C6H11O- + H+ = C6H12O

Quantity Value Units Method Reference Comment
Δr1546. ± 8.8kJ/molG+TSRozeboom, Kiplinger, et al., 1984gas phase
Quantity Value Units Method Reference Comment
Δr1518. ± 8.4kJ/molIMRERozeboom, Kiplinger, et al., 1984gas phase

References

Rozeboom, Kiplinger, et al., 1984
Rozeboom, M.D.; Kiplinger, J.P.; Bartmess, J.E., The Anionic Oxy-Cope Rearrangement: Structural Effects in the Gas Phase and in Solution, J. Am. Chem. Soc., 1984, 106, 4, 1025, https://doi.org/10.1021/ja00316a035 . [all data]