6,6-dimethylfulven-7-ide anion

Reaction thermochemistry data

Data compiled by: John E. Bartmess

Individual Reactions

C8H9- + Hydrogen cation = 1,3-Cyclopentadiene, 5-(1-methylethylidene)-

By formula: C8H9- + H+ = C8H10

Quantity Value Units Method Reference Comment
Δr354.1 ± 3.2kcal/molG+TSBrickhouse and Squires, 1988gas phase; Acidity between nPrSH, iPrSH
Quantity Value Units Method Reference Comment
Δr347.5 ± 3.0kcal/molIMRBBrickhouse and Squires, 1988gas phase; Acidity between nPrSH, iPrSH

References

Brickhouse and Squires, 1988
Brickhouse, M.D.; Squires, R.R., Gas Phase Bronsted vs. Lewis Acid-Base Reactions of 6,6-Dimethylfulvene. A Sensitive Probe of the Electronic Structures of Organic Anions, J. Am. Chem. Soc., 1988, 110, 9, 2706, https://doi.org/10.1021/ja00217a002 . [all data]