MnF2..F anion

Gas phase thermochemistry data

Data compiled by: John E. Bartmess

Quantity Value Units Method Reference Comment
Δfgas-272.2 ± 4.5kcal/molTherBoltalina, Borshchevskii, et al., 1992Critical review; value altered from reference due to conversion from electron convention to ion convention

Reaction thermochemistry data

Data compiled by: John E. Bartmess

Individual Reactions

F3Mn- + AlF4Li = AlF7LiMn-

By formula: F3Mn- + AlF4Li = AlF7LiMn-

Quantity Value Units Method Reference Comment
Δr54.7 ± 2.0kcal/molTDAsSidorov and Gubarevich, 1982gas phase; At 1125K; value altered from reference due to conversion from electron convention to ion convention

F3Mn- + F2Mn = F5Mn2-

By formula: F3Mn- + F2Mn = F5Mn2-

Quantity Value Units Method Reference Comment
Δr49.1 ± 2.0kcal/molTDAsSidorov and Gubarevich, 1982gas phase; At 1125K; value altered from reference due to conversion from electron convention to ion convention

References

Boltalina, Borshchevskii, et al., 1992
Boltalina, O.V.; Borshchevskii, A.Y.; Sidorov, L.N., Thermochemistry of 3d Elements Fluorides and Their Negative Ions in Gas Phase, Russ. J. Phys. Chem., 1992, 66, 1223. [all data]

Sidorov and Gubarevich, 1982
Sidorov, L.N.; Gubarevich, G.D., Dissociation of the Gaseous Complex Fluorides. Alkali Metal Trifluoromanganates and Tetrafluoromanganates, Koord. Khim., 1982, 8, 12708c. [all data]