H2S..HS anion

Gas phase thermochemistry data

Data compiled by: John E. Bartmess

Quantity Value Units Method Reference Comment
Δfgas-156.1kJ/molTherMeot-ner, 1988

Gas phase ion energetics data

Data compiled by: John E. Bartmess

Electron affinity of neutral species

EAneutral (eV) Method Reference Comment
3.060 ± 0.020LPESEntfellner, Opalka, et al., 2010Stated electron affinity is the Vertical Detachment Energy

References

Meot-ner, 1988
Meot-ner, M., Ionic Hydrogen Bond and Ion Solvation. 6. Interaction Energies of the Acetate Ion with Organic Molecules. Comparison of CH3COO- with Cl-, CN-, and SH-, J. Am. Chem. Soc., 1988, 110, 12, 3854, https://doi.org/10.1021/ja00220a022 . [all data]

Entfellner, Opalka, et al., 2010
Entfellner, M.; Opalka, D.; Boesl, U., Photodetachment-photoelectron spectroscopy of HS-center dot H2S and DS-center dot D2S: the transition states of the SH + H2S and SD + D2S reactions, Phys. Chem. Chem. Phys., 2010, 12, 31, 9035-9043, https://doi.org/10.1039/b925941d . [all data]