D2O..F anion

Gas phase thermochemistry data

Data compiled by: John E. Bartmess

Quantity Value Units Method Reference Comment
Δfgas-141.1 ± 2.0kcal/molTherLarson and McMahon, 1988Anchored to Arshadi, Yamdagni, et al., 1970: HOH..F- + DOD <=> DOD..F- + HOH, Keq=0.66

References

Larson and McMahon, 1988
Larson, J.W.; McMahon, T.B., Equilibrium Isotope Effects on the Hydration of Gas Phase Ions. The Effect of H-Bond Formation on Deuterium Isotopic Fractionation Factors for H3O+,H5O2+,F(HOH)-, and Cl(HOH)-, J. Am. Chem. Soc., 1988, 110, 4, 1087, https://doi.org/10.1021/ja00212a015 . [all data]

Arshadi, Yamdagni, et al., 1970
Arshadi, M.; Yamdagni, R.; Kebarle, P., Hydration of Halide Negative Ions in the Gas Phase. II. Comparison of Hydration Energies for the Alkali Positive and Halide Negative Ions, J. Phys. Chem., 1970, 74, 7, 1475, https://doi.org/10.1021/j100702a014 . [all data]