MnF2..MnF3 anion

Gas phase thermochemistry data

Data compiled by: John E. Bartmess

Quantity Value Units Method Reference Comment
Δfgas-448.3 ± 8.6kcal/molTherSidorov and Gubarevich, 1982At 1125K; value altered from reference due to conversion from electron convention to ion convention

Reaction thermochemistry data

Data compiled by: John E. Bartmess

Individual Reactions

F3Mn- + F2Mn = F5Mn2-

By formula: F3Mn- + F2Mn = F5Mn2-

Quantity Value Units Method Reference Comment
Δr49.1 ± 2.0kcal/molTDAsSidorov and Gubarevich, 1982gas phase; At 1125K; value altered from reference due to conversion from electron convention to ion convention

References

Sidorov and Gubarevich, 1982
Sidorov, L.N.; Gubarevich, G.D., Dissociation of the Gaseous Complex Fluorides. Alkali Metal Trifluoromanganates and Tetrafluoromanganates, Koord. Khim., 1982, 8, 12708c. [all data]