Al18 anion

Gas phase ion energetics data

Data compiled by: John E. Bartmess

Electron affinity of neutral species

EAneutral (eV) Method Reference Comment
2.75 ± 0.10LPESKawamata, Negishi, et al., 2001
3.120 ± 0.060LPESLi, Wu, et al., 1998
<2.55 ± 0.15LPESGantefoer, Gause, et al., 1988Vertical Detachment Energy: 3.10 eV
<2.64 ± 0.10LPESTaylor, Pettiette, et al., 1988EA given is Vertical Detachment Energy. Adiabatic EA est as up to 1 eV smaller

References

Kawamata, Negishi, et al., 2001
Kawamata, H.; Negishi, Y.; Nakajima, A.; Kaya, K., Electronic properties of substituted aluminum clusters by boron and carbon atoms (AlnBm-/AlnCm-); new insights into s-p hybridization and perturbed shell structures, Chem. Phys. Lett., 2001, 337, 4-6, 255-262, https://doi.org/10.1016/S0009-2614(01)00198-1 . [all data]

Li, Wu, et al., 1998
Li, X.; Wu, H.; Wang, X.; Wang, L., s-p Hybridization and Electron Shell Structures in Aluminum Clusters: A photoelectron Spectroscopy Study, Phys. Rev. Lett., 1998, 81, 9, 1909, https://doi.org/10.1103/PhysRevLett.81.1909 . [all data]

Gantefoer, Gause, et al., 1988
Gantefoer, G.; Gause, G.; Meiwes-Broer, K.H.; Lutz, H.O., Photoelectron Spectroscopy of Jet-cooled Aluminium Cluster Anions, Z. Phys. D, 1988, 9, 3, 253, https://doi.org/10.1007/BF01438297 . [all data]

Taylor, Pettiette, et al., 1988
Taylor, K.J.; Pettiette, C.L.; Craycraft, M.J.; Chesnovsky, O.; Smalley, R.E., Ultraviolet Photoelectron Spectroscopy of Negative Aluminum Clusters, Chem. Phys. Lett., 1988, 152, 4-5, 347, https://doi.org/10.1016/0009-2614(88)80104-0 . [all data]