F4SO..F anion

Gas phase ion energetics data

Data compiled by: John E. Bartmess

Electron affinity of neutral species

EAneutral (eV) Method Reference Comment
>2.39977IMRBArnold, Miller, et al., 2002

References

Arnold, Miller, et al., 2002
Arnold, S.T.; Miller, T.M.; Viggiano, A.A., A combined experimental and theoretical study of sulfur oxyfluoride anion and neutral thermochemistry and reactivity, J. Phys. Chem. A, 2002, 106, 42, 9900-9909, https://doi.org/10.1021/jp020557w . [all data]