W(CO)5(H2)

Reaction thermochemistry data

Data compiled by: José A. Martinho Simões

Individual Reactions

C5H2O5W (g) = C5O5W (g) + Hydrogen (g)

By formula: C5H2O5W (g) = C5O5W (g) + H2 (g)

Quantity Value Units Method Reference Comment
Δr>16.kcal/molKG/ESTIshikawa, Weersink, et al., 1987

References

Ishikawa, Weersink, et al., 1987
Ishikawa, Y.; Weersink, R.A.; Hackett, P.A.; Rayner, D.M., Chem. Phys. Lett., 1987, 142, 271. [all data]