(Na)[Co(CO)4]

Reaction thermochemistry data

Data compiled by: José A. Martinho Simões

Individual Reactions

0.5Dicobalt octacarbonyl (solution) + sodium (cr) = C4CoNaO4 (solution)

By formula: 0.5C8Co2O8 (solution) + Na (cr) = C4CoNaO4 (solution)

Quantity Value Units Method Reference Comment
Δr-318. ± 11.kJ/molRSCKiss, Nolan, et al., 1994solvent: Tetrahydrofuran; The reaction enthalpy was calculated from the enthalpies of the following reactions: 0.5Co2(CO)8(solution) + (Na)(Ph2CO)(solution) = (Na)[Co(CO)4](solution) + Ph2CO(solution), -157. ± 11. kJ/mol, and Ph2CO(solution) + Na(cr) = (Na)(Ph2CO)(solution), -161.1 ± 2.5 kJ/mol Kiss, Nolan, et al., 1994.

C13H10NaO (solution) + 0.5Dicobalt octacarbonyl (solution) = C4CoNaO4 (solution) + Benzophenone (solution)

By formula: C13H10NaO (solution) + 0.5C8Co2O8 (solution) = C4CoNaO4 (solution) + C13H10O (solution)

Quantity Value Units Method Reference Comment
Δr-157. ± 11.kJ/molRSCKiss, Nolan, et al., 1994solvent: Tetrahydrofuran

References

Kiss, Nolan, et al., 1994
Kiss, G.; Nolan, S.P.; Hoff, C.D., Inorg. Chim. Acta, 1994, 227, 285. [all data]