(Na)[Cr(Cp)(CO)2(PPh3)]

Reaction thermochemistry data

Data compiled by: José A. Martinho Simões

Individual Reactions

C13H16CrO3 (solution) + C25H20CrNaO2P (solution) = C25H21CrO2P (solution) + C13H15CrNaO3 (solution)

By formula: C13H16CrO3 (solution) + C25H20CrNaO2P (solution) = C25H21CrO2P (solution) + C13H15CrNaO3 (solution)

Quantity Value Units Method Reference Comment
Δr-9.99 ± 0.1kcal/molRSCKiss, Nolan, et al., 1994solvent: Tetrahydrofuran
Δr-9.01 ± 0.1kcal/molRSCKiss, Nolan, et al., 1994solvent: Acetonitrile

C25H21CrO2P (solution) + C13H20CrNaO2P (solution) = C13H21CrO2P (solution) + C25H20CrNaO2P (solution)

By formula: C25H21CrO2P (solution) + C13H20CrNaO2P (solution) = C13H21CrO2P (solution) + C25H20CrNaO2P (solution)

Quantity Value Units Method Reference Comment
Δr-5.31 ± 0.31kcal/molRSCKiss, Nolan, et al., 1994solvent: Tetrahydrofuran

References

Kiss, Nolan, et al., 1994
Kiss, G.; Nolan, S.P.; Hoff, C.D., Inorg. Chim. Acta, 1994, 227, 285. [all data]