Mg(Br)(NHMe)

Reaction thermochemistry data

Data compiled by: José A. Martinho Simões

Individual Reactions

C5H11BrMg (solution) + Methylamine (solution) = CH4BrMgN (solution) + Pentane (solution)

By formula: C5H11BrMg (solution) + CH5N (solution) = CH4BrMgN (solution) + C5H12 (solution)

Quantity Value Units Method Reference Comment
Δr-31.19 ± 0.60kcal/molRSCHolm, 1983solvent: Diethyl ether

References

Holm, 1983
Holm, T., Acta Chem. Scand. B, 1983, 37, 797. [all data]