Mg(Br)(NPh2)

Reaction thermochemistry data

Data compiled by: José A. Martinho Simões

Individual Reactions

Diphenylamine (solution) + C5H11BrMg (solution) = C12H10BrMgN (solution) + Pentane (solution)

By formula: C12H11N (solution) + C5H11BrMg (solution) = C12H10BrMgN (solution) + C5H12 (solution)

Quantity Value Units Method Reference Comment
Δr-28.39kcal/molRSCHolm, 1983solvent: Diethyl ether

References

Holm, 1983
Holm, T., Acta Chem. Scand. B, 1983, 37, 797. [all data]