Ru(dmpe)2(N2)

Reaction thermochemistry data

Data compiled by: José A. Martinho Simões

Individual Reactions

C12H34P4Ru (solution) + Nitrogen (solution) = C12H32N2P4Ru (solution) + Hydrogen (solution)

By formula: C12H34P4Ru (solution) + N2 (solution) = C12H32N2P4Ru (solution) + H2 (solution)

Quantity Value Units Method Reference Comment
Δr16.3kJ/molPACBelt, Scaiano, et al., 1993solvent: Cyclohexane; The reaction enthalpy relies on 0.85 for the quantum yield of H2 dissociation.

References

Belt, Scaiano, et al., 1993
Belt, S.T.; Scaiano, J.C.; Whittlesey, M.K., J. Am. Chem. Soc., 1993, 115, 1921. [all data]