V(Cp)(CO)3(H2)

Reaction thermochemistry data

Data compiled by: José A. Martinho Simões

Individual Reactions

Vanadium, tetracarbonyl(η5-2,4-cyclopentadien-1-yl)- (solution) + Hydrogen (solution) = C8H7O3V (solution) + Carbon monoxide (solution)

By formula: C9H5O4V (solution) + H2 (solution) = C8H7O3V (solution) + CO (solution)

Quantity Value Units Method Reference Comment
Δr13. ± 1.kcal/molPACJohnson, Popov, et al., 1991solvent: Heptane; The reaction enthalpy relies on 0.80 for the quantum yield of CO dissociation.

References

Johnson, Popov, et al., 1991
Johnson, F.P.A.; Popov, V.K.; George, M.W.; Bagratashvili, V.N.; Poliakoff, M.; Turner, J.J., Mendeleev Commun., 1991, 145.. [all data]