Cr(CO)5(CH4)

Reaction thermochemistry data

Data compiled by: José A. Martinho Simões

Individual Reactions

C6H4CrO5 (g) = C5CrO5 (g) + Methane (g)

By formula: C6H4CrO5 (g) = C5CrO5 (g) + CH4 (g)

Quantity Value Units Method Reference Comment
Δr33.5 ± 8.4kJ/molKG/ESTWells, House, et al., 1994

References

Wells, House, et al., 1994
Wells, J.R.; House, P.G.; Weitz, E., J. Phys. Chem., 1994, 98, 8343. [all data]