Rh[P(i-Pr)3]2(Cl)(H)2

Reaction thermochemistry data

Data compiled by: José A. Martinho Simões

Individual Reactions

0.5C36H84Cl2P4Rh2 (solution) + Hydrogen (g) = C18H44ClP2Rh (solution)

By formula: 0.5C36H84Cl2P4Rh2 (solution) + H2 (g) = C18H44ClP2Rh (solution)

Quantity Value Units Method Reference Comment
Δr-98.8 ± 2.7kJ/molRSCWang, Rosini, et al., 1995solvent: Benzene; The reaction enthalpy was calculated from the enthalpies of the reactions Rh[P(i-Pr)3]2(Cl)(H)2(solution) + t-BuNC(solution) = Rh[P(i-Pr)3]2(Cl)(CN-t-Bu)(solution) + H2(g), -41.4 ± 1.7 kJ/mol, and 0.5{Rh[P(i-Pr)3]2(Cl)}2(solution) + t-BuNC(solution) = Rh[P(i-Pr)3]2(Cl)(CN-t-Bu)(solution), -140.2 ± 2.1 kJ/mol Wang, Rosini, et al., 1995. The enthalpy of solution of {Rh[P(i-Pr)3]2(Cl)}2(cr) was measured as 20.1 ± 1.3 kJ/mol Wang, Rosini, et al., 1995.

References

Wang, Rosini, et al., 1995
Wang, K.; Rosini, G.P.; Nolan, S.P.; Goldman, A.S., J. Am. Chem. Soc., 1995, 117, 5082. [all data]