Hf(acac)4

Phase change data

Data compiled by: José A. Martinho Simões

Quantity Value Units Method Reference Comment
Δsub150.6 ± 4.2kJ/molCC-SBTel'noi, Larina, et al., 1991

Gas phase thermochemistry data

Data compiled by: José A. Martinho Simões

Quantity Value Units Method Reference Comment
Δfgas-509.0 ± 8.3kcal/molReviewMartinho Simões

Condensed phase thermochemistry data

Data compiled by: José A. Martinho Simões

Quantity Value Units Method Reference Comment
Δfsolid-545.0 ± 8.2kcal/molReviewMartinho Simões
Quantity Value Units Method Reference Comment
Δcsolid-2559.1 ± 8.2kcal/molCC-SBTel'noi, Larina, et al., 1991

References

Tel'noi, Larina, et al., 1991
Tel'noi, V.I.; Larina, V.N.; Kuznetsov, N.T.; Sevast'yanov, V.G.; Krasnodubskaya, S.V.; Filatov, I.Yu., Vysokochist. Veshchestva, 1991, 194.. [all data]