{[Ge(Ph)2(CHCH)]2}n

Condensed phase thermochemistry data

Data compiled by: José A. Martinho Simões

Quantity Value Units Method Reference Comment
Δfsolid137.4 ± 3.2kcal/molReviewMartinho SimõesThe title compound is a polymer. The data refer to the monomer.
Quantity Value Units Method Reference Comment
Δcsolid-3848.2 ± 2.9kcal/molCC-SBLebedev, Kiparisova, et al., 1980

References

Martinho Simões
Martinho Simões, J.A., Private communication (see http://webbook.nist.gov/chemistry/om/). [all data]

Lebedev, Kiparisova, et al., 1980
Lebedev, N.K.; Kiparisova, E.G.; Lebedev, B.V.; Sladkov, A.M.; Vasneva, N.A., Izv. Akad. Nauk SSSR, Ser. Khim., 1980, 555.. [all data]