Ge(C4Ph4)(CCH)2

Condensed phase thermochemistry data

Data compiled by: José A. Martinho Simões

Quantity Value Units Method Reference Comment
Δfsolid210.9 ± 2.3kcal/molReviewMartinho Simões
Quantity Value Units Method Reference Comment
Δcsolid-4100.8 ± 2.0kcal/molCC-SBLebedev, Milov, et al., 1975Please also see Kiparisova, Lebedev, et al., 1978 and Lebedev, Lebedev, et al., 1979.

References

Martinho Simões
Martinho Simões, J.A., Private communication (see http://webbook.nist.gov/chemistry/om/). [all data]

Lebedev, Milov, et al., 1975
Lebedev, B.V.; Milov, V.I.; Kiparisova, E.G.; Sladkov, A.M.; Luneva, L.K., Russ. J. Phys. Chem., 1975, 49, 1601. [all data]

Kiparisova, Lebedev, et al., 1978
Kiparisova, E.G.; Lebedev, B.V.; Bykova, T.A.; Sladkov, A.M.; Vasneva, N.A., Izv. Akad. Nauk SSSR, Ser. Khim., 1978, 1459.. [all data]

Lebedev, Lebedev, et al., 1979
Lebedev, N.K.; Lebedev, B.V.; Kiparisova, E.G.; Sladkov, A.M.; Vasneva, N.A., Dokl. Akad. Nauk SSSR, 1979, 246, 1405. [all data]