Ir(PPh3)2(Cl)(CO)(SO2)

Reaction thermochemistry data

Data compiled by: José A. Martinho Simões

Individual Reactions

C37H30ClIrO3P2S (solution) + Iodine (solution) = C37H30ClI2IrOP2 (solution) + Sulfur dioxide (solution)

By formula: C37H30ClIrO3P2S (solution) + I2 (solution) = C37H30ClI2IrOP2 (solution) + O2S (solution)

Quantity Value Units Method Reference Comment
Δr-102.9 ± 0.4kJ/molRSCDrago, Nozari, et al., 1979solvent: Benzene

References

Drago, Nozari, et al., 1979
Drago, R.S.; Nozari, M.S.; Klinger, R.J.; Chamberlain, C.S., Inorg. Chem., 1979, 18, 1254. [all data]