Ir(Cp*)(PMe3)(H)

Reaction thermochemistry data

Data compiled by: José A. Martinho Simões

Individual Reactions

C13H26IrP (solution) = C13H25IrP (solution) + Hydrogen atom (g)

By formula: C13H26IrP (solution) = C13H25IrP (solution) + H (g)

Quantity Value Units Method Reference Comment
Δr72.9 ± 4.3kcal/molPACNolan, Hoff, et al., 1987

References

Nolan, Hoff, et al., 1987
Nolan, S.P.; Hoff, C.D.; Stoutland, P.O.; Newman, L.J.; Buchanan, J.M.; Bergman, R.G.; Yang, G.K.; Peters, K.S., J. Am. Chem. Soc., 1987, 109, 3143. [all data]