Ir(Cp*)(PMe3)

Reaction thermochemistry data

Data compiled by: José A. Martinho Simões

Individual Reactions

C13H26IrP (solution) = C13H24IrP (solution) + 2Hydrogen atom (g)

By formula: C13H26IrP (solution) = C13H24IrP (solution) + 2H (g)

Quantity Value Units Method Reference Comment
Δr148.kcal/molESTNolan, Hoff, et al., 1987Please also see Stoutland, Bergman, et al., 1988.

References

Nolan, Hoff, et al., 1987
Nolan, S.P.; Hoff, C.D.; Stoutland, P.O.; Newman, L.J.; Buchanan, J.M.; Bergman, R.G.; Yang, G.K.; Peters, K.S., J. Am. Chem. Soc., 1987, 109, 3143. [all data]

Stoutland, Bergman, et al., 1988
Stoutland, P.O.; Bergman, R.G.; Nolan, S.P.; Hoff, C.D., Polyhedron, 1988, 7, 1429. [all data]