Rh(acac)(CH2CHCl)2

Phase change data

Data compiled by: José A. Martinho Simões

Quantity Value Units Method Reference Comment
Δsub117.2 ± 7.1kJ/molN/AJesse, Ernsting, et al., 1978

References

Jesse, Ernsting, et al., 1978
Jesse, A.C.; Ernsting, J.M.; Stufkens, D.J.; Vrieze, K., Thermochim. Acta, 1978, 25, 69. [all data]