Rh(oep)(CO)(oep)Rh

Reaction thermochemistry data

Data compiled by: José A. Martinho Simões

Individual Reactions

C73H88N8ORh2 (solution) + Carbon monoxide (solution) = C74H88N8O2Rh2 (solution)

By formula: C73H88N8ORh2 (solution) + CO (solution) = C74H88N8O2Rh2 (solution)

Quantity Value Units Method Reference Comment
Δr-38. ± 13.kJ/molEqSCoffin, Brennen, et al., 1988solvent: Toluene

References

Coffin, Brennen, et al., 1988
Coffin, V.L.; Brennen, W.; Wayland, B.B., J. Am. Chem. Soc., 1988, 110, 6063. [all data]