Co4(CO)9(C6H6)

Gas phase thermochemistry data

Data compiled by: José A. Martinho Simões

Quantity Value Units Method Reference Comment
Δfgas-1196. ± 22.kJ/molReviewMartinho Simões

Condensed phase thermochemistry data

Data compiled by: José A. Martinho Simões

Quantity Value Units Method Reference Comment
Δfsolid-1313.4 ± 4.6kJ/molReviewMartinho Simões

Phase change data

Data compiled by: José A. Martinho Simões

Quantity Value Units Method Reference Comment
Δsub117. ± 21.kJ/molTD-HFCBrown, Connor, et al., 1977

References

Martinho Simões
Martinho Simões, J.A., Private communication (see http://webbook.nist.gov/chemistry/om/). [all data]

Brown, Connor, et al., 1977
Brown, D.L.S.; Connor, J.A.; Demain, C.P.; Leung, M.L.; Martinho Simões, J.A.; Skinner, H.A.; Zafarani- Moattar, M.T., J. Organometal. Chem., 1977, 142, 321. [all data]