Co2(CO)7

Reaction thermochemistry data

Data compiled by: José A. Martinho Simões

Individual Reactions

Dicobalt octacarbonyl (solution) = C7Co2O7 (solution) + Carbon monoxide (solution)

By formula: C8Co2O8 (solution) = C7Co2O7 (solution) + CO (solution)

Quantity Value Units Method Reference Comment
Δr92.7kJ/molKinSUngváry and Markó, 1974solvent: Heptane; Temperature range: 298-328 K
Δr87.9kJ/molKinSUngváry, 1972solvent: Heptane; Temperature range: 307-337 K

References

Ungváry and Markó, 1974
Ungváry, F.; Markó, L., J. Organometal. Chem., 1974, 71, 283. [all data]

Ungváry, 1972
Ungváry, F., J. Organometal. Chem., 1972, 36, 363. [all data]