Co(py)(dmg)2(Me)

Reaction thermochemistry data

Data compiled by: José A. Martinho Simões

Individual Reactions

C14H22CoN5O4 (solution) + Iodine (solution) = C13H19CoIN5O4 (solution) + Methane, iodo- (solution)

By formula: C14H22CoN5O4 (solution) + I2 (solution) = C13H19CoIN5O4 (solution) + CH3I (solution)

Quantity Value Units Method Reference Comment
Δr-92.9 ± 2.5kJ/molRSCToscano, Seligson, et al., 1989solvent: Bromoform; The enthalpy of solution of Co(py)(dmg)2(Me)(cr) was measured as 10.9 kJ/mol Toscano, Seligson, et al., 1989

References

Toscano, Seligson, et al., 1989
Toscano, P.J.; Seligson, A.L.; Curran, M.T.; Skrobutt, A.T.; Sonnenberger, D.C., Inorg. Chem., 1989, 28, 166; ibid. 1989. [all data]