Ru(CO)5

Phase change data

Data compiled by: José A. Martinho Simões

Quantity Value Units Method Reference Comment
Δvap42.2 ± 0.6kJ/molN/AKoelliker and Bor, 1991

References

Koelliker and Bor, 1991
Koelliker, R.; Bor, G., Inorg. Chem., 1991, 30, 2236. [all data]