Mn2(CO)9

Gas phase thermochemistry data

Data compiled by: José A. Martinho Simões

Quantity Value Units Method Reference Comment
Δfgas-1315.8 ± 9.4kJ/molReviewMartinho SimõesThe enthalpy of formation of Mn2(CO)9 relies on -1585.3 ± 4.3 kJ/mol for the enthalpy of formation of Mn2(CO)10(g)

Reaction thermochemistry data

Data compiled by: José A. Martinho Simões

Individual Reactions

Dimanganese decacarbonyl (g) = C9Mn2O9 (g) + Carbon monoxide (g)

By formula: C10Mn2O10 (g) = C9Mn2O9 (g) + CO (g)

Quantity Value Units Method Reference Comment
Δr159.0 ± 8.4kJ/molLPHPSmith, 1988The reaction enthalpy relies on an activation energy of 159.0 ± 8.4 kJ/mol and assumes a negligible activation barrier for product recombination.

References

Martinho Simões
Martinho Simões, J.A., Private communication (see http://webbook.nist.gov/chemistry/om/). [all data]

Smith, 1988
Smith, G.P., Polyhedron, 1988, 7, 1605. [all data]