MnRe(CO)10

Reaction thermochemistry data

Data compiled by: José A. Martinho Simões

Individual Reactions

Dimanganese decacarbonyl (solution) + Dirhenium decacarbonyl (solution) = 2C10MnO10Re (solution)

By formula: C10Mn2O10 (solution) + C10O10Re2 (solution) = 2C10MnO10Re (solution)

Quantity Value Units Method Reference Comment
Δr121. ± 31.kJ/molPCHarel and Adamson, 1986solvent: Cyclohexane; The reaction enthalpy was calculated from the enthalpies of the following reactions: Mn2(CO)10(solution) + I2(solution) = 2Mn(CO)5(I)(solution), -187.9 ± 8.4 kJ/mol, Re2(CO)10(solution) + I2(solution) = 2Re(CO)5(I)(solution), -157. ± 16. kJ/mol, and MnRe(CO)10(solution) + I2(solution) = Mn(CO)5(I)(solution) + Re(CO)5(I)(solution), -233. ± 13. kJ/mol
Δr34.4 ± 1.3kJ/molEqSMarcomini and Poë, 1984solvent: Decalin; Temperature range: 443-463 K

C10MnO10Re (solution) + Iodine (solution) = Rhenium, pentacarbonyliodo- (solution) + Manganese, pentacarbonyliodo- (solution)

By formula: C10MnO10Re (solution) + I2 (solution) = C5IO5Re (solution) + C5IMnO5 (solution)

Quantity Value Units Method Reference Comment
Δr-233. ± 13.kJ/molPCHarel and Adamson, 1986solvent: Cyclohexane

References

Harel and Adamson, 1986
Harel, Y.; Adamson, A.W., J. Phys. Chem., 1986, 90, 6693. [all data]

Marcomini and Poë, 1984
Marcomini, A.; Poë, A., J. Chem. Soc., Dalton Trans., 1984, 95.. [all data]