Mn(Cp)(CO)2(CH2Br2)

Reaction thermochemistry data

Data compiled by: José A. Martinho Simões

Individual Reactions

C14H21MnO2 (solution) + Methane, dibromo- (solution) = C8H7Br2MnO2 (solution) + Heptane (solution)

By formula: C14H21MnO2 (solution) + CH2Br2 (solution) = C8H7Br2MnO2 (solution) + C7H16 (solution)

Quantity Value Units Method Reference Comment
Δr-51.0 ± 5.0kJ/molPACYang and Yang, 1992solvent: Heptane

References

Yang and Yang, 1992
Yang, P.-F.; Yang, K.G., J. Am. Chem. Soc., 1992, 114, 6937. [all data]