W(CO)3(PCy3)2(N2)

Reaction thermochemistry data

Data compiled by: José A. Martinho Simões

Individual Reactions

C39H66N2O3P2W (solution) + Hydrogen (g) = C39H68O3P2W (solution) + Nitrogen (g)

By formula: C39H66N2O3P2W (solution) + H2 (g) = C39H68O3P2W (solution) + N2 (g)

Quantity Value Units Method Reference Comment
Δr18.4 ± 1.7kJ/molEqSGonzalez and Hoff, 1989solvent: Tetrahydrofuran; Temperature range: 288-308 K

References

Gonzalez and Hoff, 1989
Gonzalez, A.A.; Hoff, C.D., Inorg. Chem., 1989, 28, 4295. [all data]