W(CO)3(PCy3)2(py)

Reaction thermochemistry data

Data compiled by: José A. Martinho Simões

Individual Reactions

C39H68O3P2W (solution) + 1,3-Diazine (solution) = C44H71NO3P2W (solution) + Hydrogen (g)

By formula: C39H68O3P2W (solution) + C4H4N2 (solution) = C44H71NO3P2W (solution) + H2 (g)

Quantity Value Units Method Reference Comment
Δr-9.49 ± 0.50kcal/molRSCGonzalez, Zhang, et al., 1988solvent: Toluene
Δr-9.99 ± 0.50kcal/molRSCGonzalez, Zhang, et al., 1988solvent: Tetrahydrofuran

References

Gonzalez, Zhang, et al., 1988
Gonzalez, A.A.; Zhang, K.; Nolan, S.P.; Lopez de la Vega, R.; Mukerjee, S.L.; Hoff, C.D., Organometallics, 1988, 7, 2429. [all data]