W(CO)5(N2O)

Reaction thermochemistry data

Data compiled by: José A. Martinho Simões

Individual Reactions

C5N2O6W (g) = C5O5W (g) + Nitrous oxide (g)

By formula: C5N2O6W (g) = C5O5W (g) + N2O (g)

Quantity Value Units Method Reference Comment
Δr61.1 ± 2.1kJ/molKinGWeitz, 1994
Δr92. ± 8.kJ/molESTBogdan, Wells, et al., 1991

References

Weitz, 1994
Weitz, E., J. Phys. Chem., 1994, 98, 11256. [all data]

Bogdan, Wells, et al., 1991
Bogdan, P.L.; Wells, J.R.; Weitz, E., J. Am. Chem. Soc., 1991, 113, 1294. [all data]