W(CO)5(CF4)

Reaction thermochemistry data

Data compiled by: José A. Martinho Simões

Individual Reactions

C5O5W (g) + Tetrafluoromethane (g) = C6F4O5W (g)

By formula: C5O5W (g) + CF4 (g) = C6F4O5W (g)

Quantity Value Units Method Reference Comment
Δr<-5.00kcal/molEqGBrown, Ishikawa, et al., 1990Temperature range: ca. 300-350 K

References

Brown, Ishikawa, et al., 1990
Brown, C.E.; Ishikawa, Y.; Hackett, P.A.; Rayner, D.M., J. Am. Chem. Soc., 1990, 112, 2530. [all data]