W(CO)5(n-C6H14)

Reaction thermochemistry data

Data compiled by: José A. Martinho Simões

Individual Reactions

C5O5W (g) + n-Hexane (g) = C11H14O5W (g)

By formula: C5O5W (g) + C6H14 (g) = C11H14O5W (g)

Quantity Value Units Method Reference Comment
Δr-10.8 ± 3.0kcal/molEqGBrown, Ishikawa, et al., 1990Temperature range: ca. 300-350 K

References

Brown, Ishikawa, et al., 1990
Brown, C.E.; Ishikawa, Y.; Hackett, P.A.; Rayner, D.M., J. Am. Chem. Soc., 1990, 112, 2530. [all data]