W(CO)5(C3H8)

Reaction thermochemistry data

Data compiled by: José A. Martinho Simões

Individual Reactions

C5O5W (g) + Propane (g) = C8H8O5W (g)

By formula: C5O5W (g) + C3H8 (g) = C8H8O5W (g)

Quantity Value Units Method Reference Comment
Δr-33.9 ± 8.4kJ/molEqGBrown, Ishikawa, et al., 1990Temperature range: ca. 300-350 K

References

Brown, Ishikawa, et al., 1990
Brown, C.E.; Ishikawa, Y.; Hackett, P.A.; Rayner, D.M., J. Am. Chem. Soc., 1990, 112, 2530. [all data]