W(CO)5(C2H6)

Reaction thermochemistry data

Data compiled by: José A. Martinho Simões

Individual Reactions

C5O5W (g) + Ethane (g) = C7H6O5W (g)

By formula: C5O5W (g) + C2H6 (g) = C7H6O5W (g)

Quantity Value Units Method Reference Comment
Δr-7.4 ± 2.0kcal/molEqGBrown, Ishikawa, et al., 1990Temperature range: ca. 300-350 K
Δr-9.7 ± 3.0kcal/molEqGIshikawa, Brown, et al., 1988Temperature range: 298-363 K

References

Brown, Ishikawa, et al., 1990
Brown, C.E.; Ishikawa, Y.; Hackett, P.A.; Rayner, D.M., J. Am. Chem. Soc., 1990, 112, 2530. [all data]

Ishikawa, Brown, et al., 1988
Ishikawa, Y.; Brown, C.E.; Hackett, P.A.; Rayner, D.M., Chem. Phys. Lett., 1988, 150, 506. [all data]