W(CO)5(thf)

Reaction thermochemistry data

Data compiled by: José A. Martinho Simões

Individual Reactions

Tetrahydrofuran (solution) + Tungsten hexacarbonyl (solution) = C9H8O6W (solution) + Carbon monoxide (solution)

By formula: C4H8O (solution) + C6O6W (solution) = C9H8O6W (solution) + CO (solution)

Quantity Value Units Method Reference Comment
Δr60.7 ± 4.2kJ/molPCNakashima and Adamson, 1982solvent: Tetrahydrofuran

References

Nakashima and Adamson, 1982
Nakashima, M.; Adamson, A.W., J. Phys. Chem., 1982, 86, 2905. [all data]